Console Output

Skipping 1,588,908 KB.. Full Log
p�Q��������V5�#
��Q�"��6�P�#
�SQ���#
�"�SQh
,��� p�#
�SQ����������#
�SQ�#
lR�����������Rm
���#
0�#
0�#
'YA1 �XVc��������Ly��#
��#
�z�	"N������6B�#
�z�	0�Ly�@�#
0�#
y :@�H���"@('`�g�GP�#
`��#
z�	�#
���{9
}���*�*�W,���z�	7y���z�	@���#
�#
���#
��0�p������@z�	��
�W,���@�����#
�#
P��W,���@�#
@@����#
P���#
@�#
3ن0�������b��@�#
@�#
�g�r�����@�#
���h���g{��W,���@�#
��Sc� ����#
���������@�#
0�#
@�#
�W,��ׂ3z9�A~�������� �#
 �#
��������p�#
>P�#
���������؆P��t��s�p�#
���@H��H��`�H����H��5�1��?H��tH���:u�H��H)�����@8�u
�H���8�t��u�1��H�������+�Q�����"�)�Q����h
 )�Q��������,�Q0��������w�@��������h
k�@��������^~�@�����D����@�����������������������@��root:ricted_ip��M��[�M�<������o�0�%�%0�I�I�0����������@�������O�c���� ���p�����@��� ���p��� ���fz�d6�)����������������@��#�)��@J{�����Q8�������*.�O�0���.���P����5�0X!�����p���P����0����0������T�`O�����c�*������ 0������(��� ��1 �P���@ELF>�5@@8@����l����@����"��l�����h
 a�l��������� �������-�)�������"�(�)����h
 �0(�)`���I�)������"�F�)h
 ������
F�)�������� ���I�)��p����?���O�����(6�(0�������`l���������������<��@����=���������W,���
K�0 ��X������`+���c=���d*�ϯ4�����ԩ���QXC/var/run/nscd/socketԩ��7��������W,����=�`l��W,���ܪ��X����������������@������������������������)�Q@����@�����O����/t��ϯw���O���������x��H������aA/t������=\�@_@P���@���@UX�o�/t���aAP5@���P���1�]��1����0]��1P5
`��������L�B�O�����������������������������Vp����Q�)B�����~q(@��
@���QX����p�}��������DPa��ջ�`(0����"a*��������0�����`�������0�����s��p��p�@UX�p��w�@��ä���h
k�@���Q)��
���p�����I��(�������3��0������@���E���P���@���E���K���P���V����Q�Q-�Q8�QM�QU�Qp�Q��Q��Q�Qrootx0:rootin/bash�����	�����0��� ���/S�0S����� ��� ���0����PXHXHP��P@>>@``P�Q00���� �������>88�����0��� 0���Ȳ��Ĕ������������������Q�0X��0����>?�B?�B�#�t�Oa[ޑ͟X`㊚`/81(�10��� �����������>P���@ELF>PQ@@8@$#XHXHPPP����..(>(N(N8XH>HNHN�����W,��� p�������S�S�`�E������/tmp/LizardFS-autotests/mnt/mfs0 P�td�����Q�tdR�td(>(N(N����o�`hThTGNU`0�(�(`@@0�����0�`pT����1�v����� ��ᆳ�����҆�������������������������������M�D�[�M�<��2�>��W��QXB0z����:h�p�������S�S�`�E���/tmp/LizardFS-autotests/mnt/mfs0`����`���o� �� @�1�1 @P@E@E@P``p`@0���DD'YA1 �������O�c�������P����� ������P������fz�$��)���������`�����@�d��)��@J{����Q8������*.�O����.�E�0���`���P���0����������E�O�����c�*`�����M��5���O����9��0@��ϯ	���O���������p�����������bA9��0����Ծ�\�h@��������J��o�<��m�9��0(����bAP5��������1��^��1P�^��1P5@���@���������O�����,IAP5@���P���1�
��V�����W�@�K�h��������~q�����1�\��1�������W��0������H��������~q@
0�����`�������0�����0�����`�������0�����DD�c	���������1g��	iB�b�W����`���p��hlBp���W,���0�����W�D0����z�I�W����W�����hhH�����E�S������������������
192.168.30.39����9602p�  ����g� ���
192.168.30.39@���9602��  ����/����@�?�
��?���?�?�P���0����W�����`�E������G����`���CE�����W��� P��[�e=mfs,fs��E��E39:9602��W�R9֥�$� D�P_�26X���������PP�P �Eu��X���@��Ep9�P�P�g�r� �E���)��P�o{�X��������1 �EP���N�EH����������������������'���R���_������������8�������i�a�s��������-�O�d�y������j�����
�*�;�����������������Q������'�[������[���������������	�@	�a	��	��	��	��	��	�#
�5
�S
�s
��
��
��
���@�t������O�x����
��
�*�8�n��������e��X�����d@@8	 �E��
��������mfsmount-c/tmp/LizardFS-autotests/lizardfs/etc/mfsmount0.cfg/tmp/LizardFS-autotests/mnt/mfs0SHELL=/bin/bashTESTS_DISPATCHER_URL=http://overlord:6789/SUDO_GID=100RUN_TESTS_DISPLAY_URL=https://dev.lizardfs.com/jenkins/job/lizardfs.ConcurrentJob/17728/display/redirect?page=testsMOUNT_EXTRA_CONFIG=mfscachemode=NEVERLIZARDFS_LOG_ORIGIN=yesJENKINS_SERVER_COOKIE=85b690762c407a39GIT_PREVIOUS_SUCCESSFUL_COMMIT=32e017505b4d0e994bc9dc47a641149b6b26bf1eBUILD_CAUSE=UPSTREAMTRIGGERTEST_OUTPUT_DIR=/home/jenkins/workspace/workspace/lizardfs.ConcurrentJob/test_outputRUN_CHANGES_DISPLAY_URL=https://dev.lizardfs.com/jenkins/job/lizardfs.ConcurrentJob/17728/display/redirect?page=changesSUDO_COMMAND=/usr/bin/bash -c set -eu; source tools/test_main.sh; test_begin; trap test_end INT;  source '/home/jenkins/workspace/workspace/lizardfs.ConcurrentJob/tests/test_suites/LongSystemTests/test_brute_force_lost_chunks_ec_21_k.sh'; test_endSUDO_USER=jenkinsCHUNKSERVER_EXTRA_CONFIG=READ_AHEAD_KB = 1024|MAX_READ_BEHIND_KB = 2048EDITOR=/usr/bin/nanoHUDSON_HOME=/var/lib/jenkinsPWD=/tmp/LizardFS-autotests/var/mount0failed_file=$failed_fileERROR_DIR=/tmp/lizardfs_error_dirLOGNAME=lizardfstestXDG_SESSION_TYPE=ttyMASTER_CUSTOM_GOALS=8 ec_21_15: $ec(21,15)BUILD_URL=https://dev.lizardfs.com/jenkins/job/lizardfs.ConcurrentJob/17728/BUILD_CAUSE_UPSTREAMTRIGGER=trueLIZARDFS_ROOT=/home/jenkins/workspace/workspace/lizardfs.ConcurrentJob/install/lizardfsJOB_URL=https://dev.lizardfs.com/jenkins/job/lizardfs.ConcurrentJob/BUILD_NUMBER=17728_=/tmp/LizardFS-autotests/temp_1632673701.070664114_3855031_valgrind.shTEST_SUITE_NAME=LongSystemTestsUSE_VALGRIND=YESASSERT_FILE=test_suites/TestTemplates/test_brute_force_lost_chunks_ec_n_k.incMOTD_SHOWN=pamn=21k=15CHUNKSERVERS=36BUILD_DISPLAY_NAME=#17728HOME=/var/lib/lizardfstestDISPATCHER_URL=http://overlord:6789/LANG=en_US.UTF-8TEST_CASE_NAME=test_brute_force_lost_chunks_ec_21_kJENKINS_URL=https://dev.lizardfs.com/jenkins/JOB_BASE_NAME=lizardfs.ConcurrentJobJOB_NAME=lizardfs.ConcurrentJobRUN_DISPLAY_URL=https://dev.lizardfs.com/jenkins/job/lizardfs.ConcurrentJob/17728/display/redirectSSH_CONNECTION=192.168.30.10 33148 192.168.30.39 22JOB_DISPLAY_URL=https://dev.lizardfs.com/jenkins/job/lizardfs.ConcurrentJob/display/redirectWORKSPACE=/home/jenkins/workspace/workspace/lizardfs.ConcurrentJobROOT_BUILD_CAUSE_TIMERTRIGGER=trueGIT_PREVIOUS_COMMIT=32e017505b4d0e994bc9dc47a641149b6b26bf1eHUDSON_URL=https://dev.lizardfs.com/jenkins/VALGRIND=YesXDG_SESSION_CLASS=userTERM=xtermNODE_NAME=fedora34LESSOPEN=||/usr/bin/lesspipe.sh %sUSER=lizardfstestTEST_SUITE=LongSystemTestsHUDSON_SERVER_COOKIE=85b690762c407a39GERRIT_REFSPEC=refs/heads/masterGIT_URL=ssh://jenkins@dev.lizardfs.com:29418/lizardfsSHLVL=4BUILD_TAG=jenkins-lizardfs.ConcurrentJob-17728USE_RAMDISK=YESEXECUTOR_NUMBER=0HUDSON_COOKIE=00999db2-70ca-4f39-b77a-035e24bc26c0XDG_SESSION_ID=37JENKINS_HOME=/var/lib/jenkinsCMAKE_BUILD_TOOL=/usr/bin/gmakeGERRIT_BRANCH=masterRUN_UNITTESTS=FalseXDG_RUNTIME_DIR=/run/user/1003EXCLUDE_TESTS=test_chunk_rebalancing:test_ec_brute_force_lost_chunksROOT_BUILD_CAUSE=TIMERTRIGGERSSH_CLIENT=192.168.30.10 33148 22GIT_COMMIT=32e017505b4d0e994bc9dc47a641149b6b26bf1ewhich_declare=declare -fNODE_NUMBER=2NODE_LABELS=concurrent_worker fedora-34 fedora34 long longtests manuallongtests sanity short synchronizeWORKSPACE_TMP=/home/jenkins/workspace/workspace/lizardfs.ConcurrentJob@tmpBUILD_TIMESTAMP=2021-09-25 00:00:08 CESTERROR_FILE=/tmp/Lizardfs_bashtests_global_env/test_errPATH=/home/jenkins/workspace/workspace/lizardfs.ConcurrentJob/install/lizardfs/sbin:/home/jenkins/workspace/workspace/lizardfs.ConcurrentJob/install/lizardfs/bin:/usr/local/sbin:/usr/local/bin:/usr/sbin:/usr/bin:/sbin:/bin:/var/lib/snapd/snap/binCI=trueRUN_ARTIFACTS_DISPLAY_URL=https://dev.lizardfs.com/jenkins/job/lizardfs.ConcurrentJob/17728/display/redirect?page=artifactsSUDO_UID=1003DBUS_SESSION_BUS_ADDRESS=unix:path=/run/user/1003/busSOURCE_DIR=/mnt/jenkins-worker/jenkins/workspace/workspace/lizardfs.ConcurrentJobASSERT_NAME=assert_program_installedGIT_BRANCH=refs/selected_commitBUILD_ID=49ASSERT_LINE=1OLDPWD=/home/jenkins/workspace/workspace/lizardfs.ConcurrentJob/testsLD_PRELOAD=/usr/libexec/valgrind/vgpreload_core-amd64-linux.so:/usr/libexec/valgrind/vgpreload_memcheck-amd64-linux.so��W,��ׂ3z9�A~mfsmountx86_64/home/jenkins/workspace/workspace/lizardfs.ConcurrentJob/tests/lizardfs-tests.cc:98: Failure
Failed
(FATAL) Errors in valgrind__mfsmount_3858527.log.core.3858527
[  FAILED  ] LongSystemTests.test_brute_force_lost_chunks_ec_21_k (77755723 ms)
[----------] 1 test from LongSystemTests (77755723 ms total)

[----------] Global test environment tear-down
[==========] 1 test from 1 test suite ran. (77755723 ms total)
[  PASSED  ] 0 tests.
[  FAILED  ] 1 test, listed below:
[  FAILED  ] LongSystemTests.test_brute_force_lost_chunks_ec_21_k

 1 FAILED TEST
[----------](B Global test environment tear-down
[==========](B 7 tests from 1 test case ran. (180501489 ms total)
[  PASSED  ](B 3 tests.
[  FAILED  ](B 4 tests, listed below:
[  FAILED  ](B LongSystemTests.test_auto_recovery_build
[  FAILED  ](B LongSystemTests.test_brute_force_lost_chunks_ec_16_k
[  FAILED  ](B LongSystemTests.test_brute_force_lost_chunks_ec_7_k
[  FAILED  ](B LongSystemTests.test_brute_force_lost_chunks_ec_21_k

 4 FAILED TEST
Build step 'Execute shell' marked build as failure
Build step 'Execute shell' marked build as failure
Archiving artifacts
Recording test results
[Checks API] No suitable checks publisher found.
Finished: FAILURE