Console Output

Skipping 345,018 KB.. Full Log
 h
h
����Z�%�#���7\!�#������C��������� h
!�#%�#$�#0�����R������`\����`y�5W#P�p�#W#�����C�56��^h����R�Z��� Q�	�Z�������C���������
0h
h
����Z�%�#�� Q�	!�#������C�PbX��������bbh
!�#8%�#y $�#0������^h�����p��n�P��n�P��&� 0������^h������$i	�P���p����PP^�������PPp���������/�!����n�@�I������!`�)p��z�X�� D(@��A����P���`\����:3343247`y�en pipe
����t^#P
�p
� ^#�����C�_h���43��^h���;�;��Z�#?����`y����8^#���`\�������`y�0qP��wPa��0����Eo�����p eX0�PbX Q�	PbXp!�#-#���:l!�wPap�+%y �l!�r!tcp send error: Broken pipe��^h�����p
��n�P��n�P��&� 0������^h������b�L�	
�0������p	������^���������p	���������/�!����n�@	�I���
���!`�)p	��z�X���wPa+% D(@	��� D(p	���09/26/21 15:37:43.258 [warning] [2534118:3343247] : read file error, inode: 157, index: 0, chunk: 243, version: 13 - no valid copies (try counter: 31)
p
�>�231��^h���@��p
� ^#���n�P��n��
��
�z�!8������j��1.0x��>�1.0������P�����#��G�������
�j��1.0x��1.0���.�
����P��p���#��0�G���f������Y��.1���P��`���#�������^h����]#�����]#`�����C�7��������

}N37>h
�]#J�]#h
��"P����"#���?��"�����"������C� 0������������

 &h
��"�]#��"�]#�]#���������]#��^h���h
h�"�0��������C����������'R�����R�������C���������
KQ32998h
R�.R� ����P�����#�� �i�� � 0���#����#��2143363147��^h��������]#p���y�
�������@���\X"�����~����1633362429��^h���������]#`����y�"�������������3��������@cX������������192131072��^h���3�����"��3��y������3�3�3�3�Z���3��������^h�����wPa��������p�A������^�������
��0���!�wPa��^h���C������"j���3�wPaU���00����.&y �mU!1632663526 09.26 15:38:46.585045: uid:998 gid:1996 pid:3362429 cmd:read (84,131072,192397312): OK (131072)
�����
��P� �-	���
@cX�U V���
��@��� P� �8��p����
����+� ���)�N����
�� P� 8��0?�@cX�����U��@cX@�����G0�P�0�(���(H���^h�������))�@�������������p��!�N�0�Llw������h�5y�.h���!�N�`����/v��@�h�5pI�pI�pI����S�� ������8��TPw�T�wB�����5w0��8
�@&)���,�
0_ �`��z��#)��p��0_0_P�H|�PbX0_0_|�� ��y ��P�P���P�p�p�����
0��@��� �h����^h������������}N3��KQ3�����������0�����
����W�,�
�wPa88Pa88PaP�`����?�9����@�p����������^h����9s������9w��	�9Y���9P����`����&��
��
������`�����^h���P`�����������c���^\�_\���'�'��VorNY�^\�_\�������VoL�Y��V�n�GY���^h���'�^\��}�����-�����������3'����'���^h���79�,�d���#���3�)��)����������*��b��� d�H��H��`�H����H��5�1��?H��tH���:u�H��H)�����@8�u
�H���8�t��u�1��H���cV#P�������aV# �������C���������h
aV#dV#0���@���e������������h
�������������^���������(��Wp��������������������������������root:ricted_ipd�9��9����X0�%�%0���������TR���`"�������������������������������nn������������ �V/;��f��V�6�GY����������s���9�������9������������87���� �������������������a[)B�������������+��`�����TR�������p���`�����u������ ��P������������� �����@ELF��3����fII"/var/run/nscd/socket��h������������0Ac����� ��^h���%%�P�������s���������`���P����������fII"�������`���p�����
(��	���(��������������������X���������d�����������������/var/run/nscd/socket�"������5P�������^h����������s���^h���<���P�������`���@���������������������H�����������/tP�����a�������������������<�/t��=�����������������
H���D���/t��<�(�������������
������Q~�����'0!^��h�������������}������P��������(��������Q�#GU##�(���}������e���
�������@��%����'���`"����������`[X�������U��a�0���bnss_files.so.2_64-linux-gnu/li�U#WU#`��j�`�������PbX������e�����C�����h
����������Q�#GU#	��
c��(��������M���(����&���������`�����������������������������������IU#SU#eU#pU#�U#�U#�U#�U#�U#WU#rootx0:rootin/bashp����.�@x6x6�Y�����@ ����V��0X ���0p���ce���������0p�������E/���������o���� ��}`a�0���`!X���P�p���`a���a�da�d��X�8�Oa ���f��`x�E!��p���`����u����P�P���@ELF>�@@X@8	@x6x6@@@U�U�����#�#888 (PPP��888$$P�td������$$Q�tdR�td888��GNU%|����O���;^��)���F�	
0�*�A@�H#�A�:A6$@b�P�OSaw	������(��H8�X@��CiJ���J2(At��&2�b  l��(��Y� G���

�H��S"-$<'�8"�	
����`����^h������ae�@��@���������#�K#0p����������A��`��@��@��@��@��@��`����K#`���?������������?0�`������������^h���:a/J�A��G�Oa�<x��`[XBz��@�������������@��@�������/tmp/LizardFS-autotests/mnt/mfs0H���������������H���P�������W���]#�O���������T���]#��^h������� ��� ���pe�`[X@ ����
�]#]#����@�e����������T�ry���h���������g���������C�)��������
�)-h
�g���h�0����.���k����yO�Y�[�H���	(0`��������V�P���������������������@����00���ce������`���
�00���`������@��`����e����������e�h�80i����0i�0i����#�����������e���<���@����������U#WU#`�����$%|%������XA�p%�H���D���XA�H'�g���$%���D��������������
��$%��g�������������������������������������0����6�p%��+|������`�����`�������������������b������totests/���clCache�����^h�����;��`�������@������@���`�����`���@���^h���O���������x��0��������^h�������@���`�������e����P����Y�k�
��^h������@������
���f�
��^h�����������p���P�����8��������������������������������0���P���
192.168.30.32p���9602��  ���� eX����
192.168.30.32����9602���  8���/����@�?�
��?���?�?������������������������p���5 ���`����X�������� �� n���`���
a/J�A��G�Oa�<xG�Oa�<xG�Oa�<x�" �������@
�h�(��04X�������E�"`��"

�X������ �����VozMNY�`��V����f��V�k�GY�X���������`�P�����H���������������������������N�l���������@�H�`������"�V����0�?�Z������/�g������J�X�m���������u�������������@�e���1�K�h������	��	��	��	��	�
�B
�I
�w
��
��
��
��
��@�P�^�����
�)
�;
�L
�r
��
��
��J��������7�K�������d@�8	`���
��������mfsmount3-c/tmp/LizardFS-autotests/lizardfs/etc/mfsmount0.cfg/tmp/LizardFS-autotests/mnt/mfs0SUDO_GID=100TEST_OUTPUT_DIR=/home/jenkins/workspace/workspace/lizardfs.ConcurrentJob/test_outputJENKINS_HOME=/var/lib/jenkinsCMAKE_BUILD_TOOL=/usr/bin/gmakeGIT_PREVIOUS_SUCCESSFUL_COMMIT=32e017505b4d0e994bc9dc47a641149b6b26bf1eFAULTY_CHUNKSERVERS=YESTEST_SUITE_NAME=LongSystemTestsUSER=lizardfstestSSH_CLIENT=192.168.30.10 37240 22CI=trueLIZARDFS_LOG_ORIGIN=yesRUN_CHANGES_DISPLAY_URL=https://dev.lizardfs.com/jenkins/job/lizardfs.ConcurrentJob/17726/display/redirect?page=changesXDG_SESSION_TYPE=ttyHUDSON_URL=https://dev.lizardfs.com/jenkins/SHLVL=4GIT_COMMIT=32e017505b4d0e994bc9dc47a641149b6b26bf1eNODE_LABELS=concurrent_worker debian-11 long longtests manuallongtests minion02 sanity short synchronizeSOURCE_DIR=/mnt/jenkins-worker/jenkins/workspace/workspace/lizardfs.ConcurrentJobLD_LIBRARY_PATH=/usr/lib/debugMOTD_SHOWN=pamHOME=/var/lib/lizardfstestOLDPWD=/home/jenkins/workspace/workspace/lizardfs.ConcurrentJob/testsBUILD_URL=https://dev.lizardfs.com/jenkins/job/lizardfs.ConcurrentJob/17726/TEST_SUITE=LongSystemTestsJENKINS_SERVER_COOKIE=85b690762c407a39TEST_CASE_NAME=test_xor_overwriting_faulty_chunkserversHUDSON_COOKIE=482ce1ce-142d-4343-843a-0dfc62f8a3e9ERROR_FILE=/tmp/Lizardfs_bashtests_global_env/test_errDBUS_SESSION_BUS_ADDRESS=unix:path=/run/user/1002/busWORKSPACE=/home/jenkins/workspace/workspace/lizardfs.ConcurrentJobSUDO_UID=1002LOGNAME=lizardfstestNODE_NAME=minion02BUILD_CAUSE=UPSTREAMTRIGGER_=/tmp/LizardFS-autotests/temp_1632607288.794361360_2533344_valgrind.shGERRIT_BRANCH=masterRUN_ARTIFACTS_DISPLAY_URL=https://dev.lizardfs.com/jenkins/job/lizardfs.ConcurrentJob/17726/display/redirect?page=artifactsASSERT_FILE=tools/valgrind.shXDG_SESSION_CLASS=userEXECUTOR_NUMBER=0GIT_BRANCH=refs/selected_commitTERM=xtermXDG_SESSION_ID=1088EXCLUDE_TESTS=test_chunk_rebalancing:test_ec_brute_force_lost_chunksASSERT_NAME=assert_program_installedRUN_TESTS_DISPLAY_URL=https://dev.lizardfs.com/jenkins/job/lizardfs.ConcurrentJob/17726/display/redirect?page=testsLIZARDFS_ROOT=/home/jenkins/workspace/workspace/lizardfs.ConcurrentJob/install/lizardfsBUILD_DISPLAY_NAME=#17726HUDSON_HOME=/var/lib/jenkinsBUILD_CAUSE_UPSTREAMTRIGGER=trueJOB_BASE_NAME=lizardfs.ConcurrentJobPATH=/home/jenkins/workspace/workspace/lizardfs.ConcurrentJob/install/lizardfs/sbin:/home/jenkins/workspace/workspace/lizardfs.ConcurrentJob/install/lizardfs/bin:/usr/local/sbin:/usr/local/bin:/usr/sbin:/usr/bin:/sbin:/binERROR_DIR=/tmp/lizardfs_error_dirXDG_RUNTIME_DIR=/run/user/1002BUILD_ID=49GLIBCPP_FORCE_NEW=1BUILD_TAG=jenkins-lizardfs.ConcurrentJob-17726DISPATCHER_URL=http://overlord:6789/LANG=CJENKINS_URL=https://dev.lizardfs.com/jenkins/JOB_URL=https://dev.lizardfs.com/jenkins/job/lizardfs.ConcurrentJob/VALGRIND=YesGIT_URL=ssh://jenkins@dev.lizardfs.com:29418/lizardfsASSERT_LINE=13SUDO_COMMAND=/usr/bin/bash -c set -eu; source tools/test_main.sh; test_begin; trap test_end INT;  source '/home/jenkins/workspace/workspace/lizardfs.ConcurrentJob/tests/test_suites/LongSystemTests/test_xor_overwriting_faulty_chunkservers.sh'; test_endBUILD_NUMBER=17726ROOT_BUILD_CAUSE_TIMERTRIGGER=trueSHELL=/bin/bashNODE_NUMBER=5BUILD_TIMESTAMP=2021-09-25 00:00:00 CESTRUN_DISPLAY_URL=https://dev.lizardfs.com/jenkins/job/lizardfs.ConcurrentJob/17726/display/redirectGERRIT_REFSPEC=refs/heads/masterROOT_BUILD_CAUSE=TIMERTRIGGERSUDO_USER=jenkinsUSE_VALGRIND=YESHUDSON_SERVER_COOKIE=85b690762c407a39JOB_DISPLAY_URL=https://dev.lizardfs.com/jenkins/job/lizardfs.ConcurrentJob/display/redirectJOB_NAME=lizardfs.ConcurrentJobPWD=/tmp/LizardFS-autotests/var/mount0SSH_CONNECTION=192.168.30.10 37240 192.168.30.32 22GIT_PREVIOUS_COMMIT=32e017505b4d0e994bc9dc47a641149b6b26bf1eRUN_UNITTESTS=FalseWORKSPACE_TMP=/home/jenkins/workspace/workspace/lizardfs.ConcurrentJob@tmpTESTS_DISPATCHER_URL=http://overlord:6789/MOUNT_EXTRA_CONFIG=mfscachemode=NEVERGLIBCXX_FORCE_NEW=1LD_PRELOAD=/usr/lib/x86_64-linux-gnu/valgrind/vgpreload_core-amd64-linux.so:/usr/lib/x86_64-linux-gnu/valgrind/vgpreload_memcheck-amd64-linux.soi��^h���79�,�d�mfsmount3x86_64/home/jenkins/workspace/workspace/lizardfs.ConcurrentJob/tests/lizardfs-tests.cc:98: Failure
Failed
(FATAL) Errors in valgrind__mfsmount3_2534118.log.core.2534118
[  FAILED  ] LongSystemTests.test_xor_overwriting_faulty_chunkservers (56277642 ms)
[----------] 1 test from LongSystemTests (56277642 ms total)

[----------] Global test environment tear-down
[==========] 1 test from 1 test suite ran. (56277642 ms total)
[  PASSED  ] 0 tests.
[  FAILED  ] 1 test, listed below:
[  FAILED  ] LongSystemTests.test_xor_overwriting_faulty_chunkservers

 1 FAILED TEST
[----------](B Global test environment tear-down
[==========](B 3 tests from 1 test case ran. (142681047 ms total)
[  PASSED  ](B 2 tests.
[  FAILED  ](B 1 test, listed below:
[  FAILED  ](B LongSystemTests.test_xor_overwriting_faulty_chunkservers

 1 FAILED TEST
Build step 'Execute shell' marked build as failure
Build step 'Execute shell' marked build as failure
Archiving artifacts
Recording test results
[Checks API] No suitable checks publisher found.
Finished: FAILURE